﻿"Item Id","Item URI","Dublin Core:Title","Dublin Core:Subject","Dublin Core:Description","Dublin Core:Creator","Dublin Core:Source","Dublin Core:Publisher","Dublin Core:Date","Dublin Core:Contributor","Dublin Core:Rights","Dublin Core:Relation","Dublin Core:Format","Dublin Core:Language","Dublin Core:Type","Dublin Core:Identifier","Dublin Core:Coverage","Item Type Metadata:Bibliography","Item Type Metadata:Biographical Text","Item Type Metadata:Occupation","Item Type Metadata:Death Date","Item Type Metadata:Organization Name","Item Type Metadata:Birthplace","Item Type Metadata:First Name","Item Type Metadata:Middle Name","Item Type Metadata:Title","Item Type Metadata:Recipient","Item Type Metadata:Script Type","Item Type Metadata:Last name","Item Type Metadata:Suffix","Item Type Metadata:Text","Item Type Metadata:Physical Dimensions","Item Type Metadata:Interviewer","Item Type Metadata:Interviewee","Item Type Metadata:Location","Item Type Metadata:Transcription","Item Type Metadata:Local URL","Item Type Metadata:Original Format","Item Type Metadata:Birth Date","Item Type Metadata:Duration","Item Type Metadata:Compression","Item Type Metadata:Producer","Item Type Metadata:Director","Item Type Metadata:Bit Rate/Frequency","Item Type Metadata:Time Summary","Item Type Metadata:Subject Line","Item Type Metadata:Participants","Item Type Metadata:Event Type","Item Type Metadata:URL","Item Type Metadata:Lesson Plan Text","Item Type Metadata:Materials","Item Type Metadata:Objectives","Item Type Metadata:Number of Attachments","Item Type Metadata:Email Body","Item Type Metadata:From","Item Type Metadata:To","Item Type Metadata:CC","Item Type Metadata:BCC","Item Type Metadata:Standards","Omeka Image File:Width","Omeka Image File:Height","Omeka Image File:Bit Depth","Omeka Image File:Channels","Omeka Image File:Exif String","Omeka Image File:Exif Array","Omeka Image File:IPTC String","Omeka Image File:IPTC Array","Omeka Video File:Bitrate","Omeka Video File:Duration","Omeka Video File:Sample Rate","Omeka Video File:Codec","Omeka Video File:Width","Omeka Video File:Height","Crowdsourcing Metadata:Flag for Review",tags,file,itemType,collection,public,featured
14276,https://mbda.berry.edu/items/show/14276,"Letter to Mr. William H. Ham from The Berry Schools",,"The author informs Mr. Ham that while they appreciate his interest, the Berry school cannot make and sell an article that he requested because they only have a small weaving room and a few looms. The author apologizes and wishes Mr. Ham the best of luck with his project.","The Berry Schools","MB Collection","Berry College Memorial Library",1938-3-1,,"Creative Commons, non-commercial, attribution, no derivatives",,image-jpeg,en-US,"Text Document",MB128_8_19_001,"Mount Berry, Georgia",,,,,,,,,,"Mr. William H. Ham ","Typewritten (or mostly typewritten)",,,,,,,,,,,,,,,,,,,,,,,,,,,,,,,,,,,,,,,,,,,,,,,"apologies,loom,project,students,weaving,weaving room,work",https://mbda.berry.edu/files/original/d5ddf89e52ecd152ee9de0ca32903b31.jpg,,,1,0
14192,https://mbda.berry.edu/items/show/14192,"Letter to Dora H. Callowhill from The Berry Schools",,"A letter explaining the purposes of Berry's weaving room. ","The Berry Schools","MB Collection","Berry College Memorial Library",1935-3-26,,"Creative Commons, non-commercial, attribution, no derivatives",,image-jpeg,en-US,"Text Document",MB104_11_14_001,"Mount Berry, Georgia",,,,,,,,,,"Mrs. Dora H. Callowhill ","Typewritten (or mostly typewritten)",,,,,,,,,,,,,,,,,,,,,,,,,,,,,,,,,,,,,,,,,,,,,,,"employment,handicrafts,Mrs. Dora H. Callowhil,weaving,weaving room,weaving sale",https://mbda.berry.edu/files/original/042df7b709d9edc1821e894a2ad2cf29.jpg,,,1,0
10836,https://mbda.berry.edu/items/show/10836,"Letter to Martha Berry from Hale Pulsifer",,"Mr. Pulsifer writes to thank Miss Berry for sending him the things from the weaving room and regrets that there was not a suitable wedding gift among them.","Mr.  Hale  Pulsifer ","MB Collection","Berry College Memorial Library",1929-5-24,,"Creative Commons, non-commercial, attribution, no derivatives",,image-jpeg,en-US,"Text Document",MB73_11_27_001,"Mount Berry, Georgia",,,,,,,,,,"Miss Martha  Berry ","Handwritten (or mostly handwritten)",,,,,,,,,,,,,,,,,,,,,,,,,,,,,,,,,,,,,,,,,,,,,,,"weaving room,wedding",https://mbda.berry.edu/files/original/d60e8e5ec76d02d58fb47c21f4528cdc.jpg,,,1,0
8908,https://mbda.berry.edu/items/show/8908,"Letter from Martha Berry to Mrs. Shulenberger",,"Martha Berry requests that Mrs. Shulenberger send her the pattern for the old coverlet, as well as any other patterns she can find, for use in the weaving room.","Miss Martha  Berry ","MB Collection","Berry College Memorial Library",1928-10-5,,"Creative Commons, non-commercial, attribution, no derivatives",,image-jpeg,en-US,"Text Document",MB70_3_6_001,"Mount Berry, Georgia",,,,,,,,,,"Mrs.   Shulenberger ","Typewritten (or mostly typewritten)",,,,,,,,,,,,,,,,,,,,,,,,,,,,,,,,,,,,,,,,,,,,,,,"coverlet,coverlets,quilts,weaving,weaving room",https://mbda.berry.edu/files/original/99d7f2064c8d65c2d3390f200108482b.jpg,,,1,0
10417,https://mbda.berry.edu/items/show/10417,"Letter to C. J.  Judd from Martha Berry",,"In this letter Martha Berry thanks Mrs. Judd for sending hte scraps of silk to be used for clothing. Martha Berry also says that she trusts that Mrs. Judd will come visit when she is in the South."," Martha  Berry ","MB Collection","Berry College Memorial Library",1929-1-28,,"Creative Commons, non-commercial, attribution, no derivatives",,image-jpeg,en-US,"Text Document",MB72_15_36_001,"Mount Berry, Georgia",,,,,,,,,,"Mrs. C. J. Judd ","Typewritten (or mostly typewritten)",,,,,,,,,,,,,,,,,,,,,,,,,,,,,,,,,,,,,,,,,,,,,,,"silk scraps,weaving room",https://mbda.berry.edu/files/original/251d834f4426cb607bc3c81491168d64.jpg,,,1,0
8428,https://mbda.berry.edu/items/show/8428,"Letter to Ellen Fink Milton from Martha Berry",,"Miss Berry thanks Mrs. Milton for her letter and thanks her for the rugs to copy which will be sent to her daughter once they are finished in the weaving room. Miss Berry also asks for Mrs. Milton to visit once she is strong enough and when the cotton fields are white."," Martha  Berry ","MB Collection","Berry College Memorial Library",1928-10-12,,"Creative Commons, non-commercial, attribution, no derivatives",,image-jpeg,en-US,"Text Document",MB69_5_79_001,"Mount Berry, Georgia",,,,,,,,,,"Mrs. Ellen F. Milton ","Typewritten (or mostly typewritten)",,,,,,,,,,,,,,,,,,,,,,,,,,,,,,,,,,,,,,,,,,,,,,,"cotton,Ellen Fink Milton,handicrafts,rugs,weaving room",https://mbda.berry.edu/files/original/a6e0f2cf64239136ac0a35a099446411.jpg,,,1,0
2159,https://mbda.berry.edu/items/show/2159,"Letter to Mrs. William McWane from Martha Berry",,"Miss Berry is returning $2 of a $4 payment for a fan order that cannot be filled presently."," Martha  Berry ","MB Collection","Berry College Memorial Library",1926-5-21,,,,image-jpeg,en-US,"Text Document",MB53_12_76_001,"Mount Berry, Georgia",,,,,,,,,,"Mrs. William  McWane ","Typewritten (or mostly typewritten)",,,,,,,,,,,,,,,,,,,,,,,,,,,,,,,,,,,,,,,,,,,,,,,"weaving room",https://mbda.berry.edu/files/original/b6808221f0dee507e8f6bae4e43f0fab.jpg,,,1,0
15358,https://mbda.berry.edu/items/show/15358,"To Miss Jewell Cox From Martha Berry ",,"A thank you letter for selling the display in the Weaving Room for the school and an invitation to come to the Commencement. "," Martha   Berry  ","MB Collection","Berry College Memorial Library",1940-3-5,,"Creative Commons, non-commercial, attribution, no derivatives",,image-jpeg,en-US,"Text Document",MB146_1_23_001,"Mount Berry, Georgia",,,,,,,,,,"Miss Jewell   Cox  ","Typewritten (or mostly typewritten)",,,,,,,,,,,,,,,,,,,,,,,,,,,,,,,,,,,,,,,,,,,,,,,"Annual commencement,Commencement,Miss Jewell Cox,weaving department,weaving room,weaving sale,Willie Sue",https://mbda.berry.edu/files/original/89c699201c4f068c2d67f9376455c569.jpg,,,1,0
14483,https://mbda.berry.edu/items/show/14483,"Letter to Mrs. W. T. Henry from E. H. Hoge ",,"A letter informing Mrs. Henry that Mr. Simonds and Mrs. Siccardi's donations were received. Hoge also mentions that Mrs. Henry Ford's brother Mr. Bryant visited on his way to see the Fords in Way, Georgia."," G H Hoge  ","MB Collection","Berry College Memorial Library",1938-2-22,,"Creative Commons, non-commercial, attribution, no derivatives",,image-jpeg,en-US,"Text Document",MB128_14_25_001,"Mount Berry, Georgia",,,,,,,,,,"Mrs. W T Henry  ","Typewritten (or mostly typewritten)",,,,,,,,,,,,,,,,,,,,,,,,,,,,,,,,,,,,,,,,,,,,,,,"$21 gift,$500 gift,E H Hoge,Mrs Ford,Mrs. W. T. Henry,weaving room",https://mbda.berry.edu/files/original/e417b56e4dcb50ab9ac972836f9debc6.jpg,,,1,0
