﻿"Item Id","Item URI","Dublin Core:Title","Dublin Core:Subject","Dublin Core:Description","Dublin Core:Creator","Dublin Core:Source","Dublin Core:Publisher","Dublin Core:Date","Dublin Core:Contributor","Dublin Core:Rights","Dublin Core:Relation","Dublin Core:Format","Dublin Core:Language","Dublin Core:Type","Dublin Core:Identifier","Dublin Core:Coverage","Item Type Metadata:Bibliography","Item Type Metadata:Biographical Text","Item Type Metadata:Occupation","Item Type Metadata:Death Date","Item Type Metadata:Organization Name","Item Type Metadata:Birthplace","Item Type Metadata:First Name","Item Type Metadata:Middle Name","Item Type Metadata:Title","Item Type Metadata:Recipient","Item Type Metadata:Script Type","Item Type Metadata:Last name","Item Type Metadata:Suffix","Item Type Metadata:Text","Item Type Metadata:Physical Dimensions","Item Type Metadata:Interviewer","Item Type Metadata:Interviewee","Item Type Metadata:Location","Item Type Metadata:Transcription","Item Type Metadata:Local URL","Item Type Metadata:Original Format","Item Type Metadata:Birth Date","Item Type Metadata:Duration","Item Type Metadata:Compression","Item Type Metadata:Producer","Item Type Metadata:Director","Item Type Metadata:Bit Rate/Frequency","Item Type Metadata:Time Summary","Item Type Metadata:Subject Line","Item Type Metadata:Participants","Item Type Metadata:Event Type","Item Type Metadata:URL","Item Type Metadata:Lesson Plan Text","Item Type Metadata:Materials","Item Type Metadata:Objectives","Item Type Metadata:Number of Attachments","Item Type Metadata:Email Body","Item Type Metadata:From","Item Type Metadata:To","Item Type Metadata:CC","Item Type Metadata:BCC","Item Type Metadata:Standards","Omeka Image File:Width","Omeka Image File:Height","Omeka Image File:Bit Depth","Omeka Image File:Channels","Omeka Image File:Exif String","Omeka Image File:Exif Array","Omeka Image File:IPTC String","Omeka Image File:IPTC Array","Omeka Video File:Bitrate","Omeka Video File:Duration","Omeka Video File:Sample Rate","Omeka Video File:Codec","Omeka Video File:Width","Omeka Video File:Height","Crowdsourcing Metadata:Flag for Review",tags,file,itemType,collection,public,featured
13914,https://mbda.berry.edu/items/show/13914,"A Letter from Martha Berry to Mr. Sam W. Small",,"Martha Berry wishes to thank Mr. Small for writing an article in the Atlanta Constitution about Mr. Ford's gift to The Berry Schools. Mr. Ford has gifted some buildings for the Girls School but the buildings are not endowed, so the school is still in need of money. Miss Berry also mentions that the school has been given the wrong kind of publicity before from the Rome paper and that she is very grateful for his article as it entered into the spirit of the situation in a wonderful way. ","Miss Martha  Berry ","MB Collection","Berry College Memorial Library",1930-1-18,,"Creative Commons, non-commercial, attribution, no derivatives",,image-jpeg,en-US,"Text Document",MB78_8_24_001,"Mount Berry, Georgia",,,,,,,,,,"Mr. Sam W. Small ","Typewritten (or mostly typewritten)",,,,,,,,,,,,,,,,,,,,,,,,,,,,,,,,,,,,,,,,,,,,,,,"article,Atlanta Constitution,buildings,ford,Girls School,not endowed,Rome paper,Sam W. Small",https://mbda.berry.edu/files/original/772defff44b899b2c7e791ca115de322.jpg,,,1,0
398,https://mbda.berry.edu/items/show/398,"A letter to Mrs. Henry Ford from Martha Berry.",,"Martha Berry thanked Mrs. Ford for her update on when Mr. Cameron will be visiting. Martha Berry also provided the current events happening at the Berry schools as well as her anticipation to the Fords upcoming visit.","Miss Martha  Berry ","MB Collection","Berry College Memorial Library",1936-10-14,,,,image-jpeg,en-US,"Text Document",MB112_15_22_001,"Mount Berry, Georgia",,,,,,,,,,"Mrs.   Ford ","Typewritten (or mostly typewritten)",,,,,,,,,,,,,,,,,,,,,,,,,,,,,,,,,,,,,,,,,,,,,,,"ford,visit",https://mbda.berry.edu/files/original/cdb45253d1a68b7e8c1eecda95cf0dc4.jpg,,,1,0
7533,https://mbda.berry.edu/items/show/7533,"A Statement to Mr. Ford about the Water Supply and Contracting Company",,"This collection contains a statement from the Berry Schools to Mr. Ford discussing the New Water Supply and encloses a statement from the Smallwood Contracting Company ","Mr. E H Hoge ","MB Collection","Berry College Memorial Library",1928-12-29,,"Creative Commons, non-commercial, attribution, no derivatives",,image-jpeg,en-US,"Text Document",MB67_11_91_001,"Mount Berry, Georgia",,,,,,,,,,"Mr. E G  ","Typewritten (or mostly typewritten)",,,,,,,,,,,,,,,,,,,,,,,,,,,,,,,,,,,,,,,,,,,,,,"I can't read the handwriting","ford,Henry Ford,new water supply,smallwood contracting company,statements","https://mbda.berry.edu/files/original/07c5150d3d2efe09483726dac8440842.jpg,https://mbda.berry.edu/files/original/c3c303e802517be71c35f3ef530e9b05.jpg,https://mbda.berry.edu/files/original/9a6d55d78eaec4f87cc9fdbd35b5e7a1.jpg,https://mbda.berry.edu/files/original/f8b81a0cfe2eb5bf98dc548cffd3d3de.jpg,https://mbda.berry.edu/files/original/1f9a4be4bfd47495d54f10847d0868aa.jpg,https://mbda.berry.edu/files/original/0dab208525a32e8a3929685bac222254.jpg,https://mbda.berry.edu/files/original/5f4b6dbe638c346444ef623bd9a3a1e8.jpg",,"The Henry and Clara Ford Series",1,0
7611,https://mbda.berry.edu/items/show/7611,"Berry with Henry and Clara Ford",,"Miss Berry sitting with Mr. and Mrs. Ford in a dining hall. ",,"MB Collection","Berry College Memorial Library",--,,"Creative Commons, non-commercial, attribution, no derivatives",,image-jpeg,,"Image or Photograph",,"Mount Berry, Georgia",,,,,,,,,,,"This document does not contain text",,,,,,,,,,,,,,,,,,,,,,,,,,,,,,,,,,,,,,,,,,,,,,,"Clara Ford,ford,Henry Ford,Martha Berry,Photo,photograph",https://mbda.berry.edu/files/original/52323e052ce547845522ab5cab6724ea.jpg,Correspondence,"The Henry and Clara Ford Series",1,0
7606,https://mbda.berry.edu/items/show/7606,"Clara Ford at the Berry School",,"Clara Ford, wife of Henry Ford, with a Berry student examining a handicraft.",,"MB Collection","Berry College Memorial Library",--,,"Creative Commons, non-commercial, attribution, no derivatives",,image-jpeg,,"Image or Photograph",,"Mount Berry, Georgia",,,,,,,,,,,"This document does not contain text",,,,,,,,,,,,,,,,,,,,,,,,,,,,,,,,,,,,,,,,,,,,,,,"female student,ford,Girls,Girls School,handicrafts",https://mbda.berry.edu/files/original/2dd2da2a351e0c44f420b22af223abb6.jpg,Correspondence,"The Henry and Clara Ford Series",1,0
7607,https://mbda.berry.edu/items/show/7607,"Henry and Clara Ford visit the Berry Schools",,"Henry and Clara Ford with Martha Berry at the Berry Schools",,"MB Collection","Berry College Memorial Library",--,,"Creative Commons, non-commercial, attribution, no derivatives",,image-jpeg,,"Image or Photograph",,"Mount Berry, Georgia",,,,,,,,,,,"This document does not contain text",,,,,,,,,,,,,,,,,,,,,,,,,,,,,,,,,,,,,,,,,,,,,,,ford,https://mbda.berry.edu/files/original/85ae317fba2349275a0ba330d1568d8c.jpg,Correspondence,"The Henry and Clara Ford Series",1,0
7610,https://mbda.berry.edu/items/show/7610,"Henry and Clara Ford with Berry Students",,"Photograph containing Mrs. & Mr. Ford with male Berry students in the background.",,"MB Collection","Berry College Memorial Library",--,,"Creative Commons, non-commercial, attribution, no derivatives",,image-jpeg,,"Image or Photograph",,"Mount Berry, Georgia",,,,,,,,,,,"This document does not contain text",,,,,,,,,,,,,,,,,,,,,,,,,,,,,,,,,,,,,,,,,,,,,,,"Clara Ford,ford,Henry Ford,Photo,photograph",https://mbda.berry.edu/files/original/3e9b7392afe2ca90e70ee8a6f1d60e5a.jpg,Correspondence,"The Henry and Clara Ford Series",1,0
13453,https://mbda.berry.edu/items/show/13453,"Henry Ford Dances with Berry Student",,"Photo of Henry Ford dancing with Berry student.","Berry Schools",,,--,,,,,,"Image or Photograph",,,,,,,,,,,,,"This document does not contain text",,,,,,,,,,,,,,,,,,,,,,,,,,,,,,,,,,,,,,,,,,,,,,"Other issue","dancing,ford,photograph",https://mbda.berry.edu/files/original/d3dbfeecdcb8a6b2c7cecc989481f665.png,,"The Henry and Clara Ford Series",1,0
7528,https://mbda.berry.edu/items/show/7528,"L. J. Thompson to E. H. Hoge, Comptroller of The Berry Schools, Inc.",,"L. J. Thompson in the office of Henry Ford enclosed a check for $4000 to cover work on the Girl's Recitation Hall by the firm of Coolidge and Carlson."," L. J. Thompson ","MB Collection","Berry College Memorial Library",1928-12-10,,"Creative Commons, non-commercial, attribution, no derivatives",,image-jpeg,en-US,"Text Document",MB67_11_86_001,"Mount Berry, Georgia",,,,,,,,,,"Mr. E. H. Hoge ","Typewritten (or mostly typewritten)",,,,,,,,,,,,,,,,,,,,,,,,,,,,,,,,,,,,,,,,,,,,,,,"comptroller,Coolidge and Carlson,ford,Girls Recitation Hall,Henry Ford",https://mbda.berry.edu/files/original/62b2a6796b30cf06b923229861b640bd.jpg,,"The Henry and Clara Ford Series",1,0
387,https://mbda.berry.edu/items/show/387,"Letter  to Martha Berry from Mrs. Clara B. Ford",,"Mrs. Ford informs Martha Berry that Mr. Ford is in better health and that they hope to visit Berry soon. She also asks if Martha Berry, Mrs. Campbell, and Virginia could come to visit her and her husband.","Mrs. Clara B. Ford ","MB Collection","Berry College Memorial Library",1936--,,,,image-jpeg,en-US,"Text Document",MB112_15_4_001,"Mount Berry, Georgia",,,,,,,,,,"Miss Martha  Berry ","Handwritten (or mostly handwritten)",,,,,,,,,,,,,,,,,,,,,,,,,,,,,,,,,,,,,,,,,,,,,,,ford,"https://mbda.berry.edu/files/original/a40f3edcc704a553bb354553921e9037.jpg,https://mbda.berry.edu/files/original/b831f98aae6ff8b87e969bd7417d9081.jpg",,,1,0
7518,https://mbda.berry.edu/items/show/7518,"Letter from E. G. Liebold to E. H. Hoge",,"E. G. Liebold, general secretary to Henry Ford, sends E. H. Hoge a check for $21,826.12 in payment to the Thompson Starrett Company for the new Girls' School buildings."," E. G. Liebold ","MB Collection","Berry College Memorial Library",1928-11-12,,"Creative Commons, non-commercial, attribution, no derivatives",,image-jpeg,en-US,"Text Document",MB67_11_76_001,"Mount Berry, Georgia",,,,,,,,,," E. H. Hoge ","Typewritten (or mostly typewritten)",,,,,,,,,,,,,,,,,,,,,,,,,,,,,,,,,,,,,,,,,,,,,,,"check,ford,Girls School,Liebold,Thompson Starrett Company",https://mbda.berry.edu/files/original/3a1d4e318518dc973c33eeca7d294702.jpg,,"The Henry and Clara Ford Series",1,0
10051,https://mbda.berry.edu/items/show/10051,"Letter from E. H. Hoge to E. G. Liebold",,"E. H. Hoge, the Comptroller for the Berry Schools, writes to E. G. Liebold to acknowledge a check sent by Henry Ford for $11,426.22 to cover the cost for a new water supply."," E. H. Hoge ","MB Collection","Berry College Memorial Library",1929-1-4,,"Creative Commons, non-commercial, attribution, no derivatives",,image-jpeg,en-US,"Text Document",MB72_7_1_001,"Mount Berry, Georgia",,,,,,,,,,"Mr. E. G. Liebold ","Typewritten (or mostly typewritten)",,,,,,,,,,,,,,,,,,,,,,,,,,,,,,,,,,,,,,,,,,,,,,,"Donation,ford,Henry Ford,water,water supply",https://mbda.berry.edu/files/original/96685fee7fabee8ae99da5573395d04f.jpg,,,1,0
7516,https://mbda.berry.edu/items/show/7516,"Letter from E. H. Hoge to Frank Campsall",,"E. H. Hoge, the Comptroller of the Berry Schools, writes to Frank Campsall to inform him that the flour sent by the Henry Ford Farms has arrived.","Mr. Frank  Campsall ","MB Collection","Berry College Memorial Library",1928-11-5,,"Creative Commons, non-commercial, attribution, no derivatives",,image-jpeg,en-US,"Text Document",MB67_11_74_001,"Mount Berry, Georgia",,,,,,,,,," E. H. Hoge ","Typewritten (or mostly typewritten)",,,,,,,,,,,,,,,,,,,,,,,,,,,,,,,,,,,,,,,,,,,,,,,"Campsall,flour,ford,Henry Ford Farms",https://mbda.berry.edu/files/original/3f79075752b3e6062c9a8dcf1678cb6e.jpg,,"The Henry and Clara Ford Series",1,0
7464,https://mbda.berry.edu/items/show/7464,"Letter from E.H. Hoge to L.J. Thompson and another to E.G. Liebold",,"In these letters E.H. Hoge representing the Berry Schools, is asking L.J. Thompson for a check for the new Girls' Recitation Halland E.G. Liebold a check for the cost of water supply."," E.H.  Hoge ","MB Collection","Berry College Memorial Library",1928-8-15,,"Creative Commons, non-commercial, attribution, no derivatives",,image-jpeg,en-US,"Text Document",MB67_11_22_001,"Mount Berry, Georgia",,,,,,,,,," L.J.  Thompson ^^ E.G.  Liebold ","Typewritten (or mostly typewritten)",,,,,,,,,,,,,,,,,,,,,,,,,,,,,,,,,,,,,,,,,,,,,,,"checks,ford","https://mbda.berry.edu/files/original/17497adb0c0f537e79e8a0fd8bd36aa4.jpg,https://mbda.berry.edu/files/original/4a675938b9d1a961ed4df256359ca388.jpg,https://mbda.berry.edu/files/original/7b62b65a479ae9726a05277652a30ff6.jpg,https://mbda.berry.edu/files/original/5d6198d3bac4f8f4c5c924f2068781a2.jpg,https://mbda.berry.edu/files/original/0e4cf8748751da2da262d3f545407221.jpg",,"The Henry and Clara Ford Series",1,0
7403,https://mbda.berry.edu/items/show/7403,"Letter from Helen Forbes to Martha Berry",,"Helen Forbes reports on a conversation with Henry and Clara Ford while at Battle Creek Sanitarium during the National Conference on Race Betterment."," Helen  Forbes ","MB Collection","Berry College Memorial Library",1928-3-6,,"Creative Commons, non-commercial, attribution, no derivatives",,image-jpeg,en-US,"Text Document",MB67_9_39_001,"Mount Berry, Georgia",,,,,,,,,,"Miss   Berry ","Handwritten (or mostly handwritten)",,,,,,,,,,,,,,,,,,,,,,,,,,,,,,,,,,,,,,,,,,,,,,,"Battle Creek Sanitarium,Clara Ford,ford,Henry Ford,John Harvey Kellogg,National Conference on Race Betterment,sanatorium,Walter T. Forbes","https://mbda.berry.edu/files/original/c5937b0a317d1da018fdf302f1be5bee.jpg,https://mbda.berry.edu/files/original/5574f64f28e019505900ec464178f2b7.jpg,https://mbda.berry.edu/files/original/338bfb2ed9f228392c68445e031d69b7.jpg",,,1,0
10423,https://mbda.berry.edu/items/show/10423,"Letter from John Harvey Kellogg to Martha Berry",,"John Harvey Kellogg regrets that Martha Berry was not able to visit the sanitarium in the fall but is glad to hear of the support Berry is receiving from Mr. Ford."," John Harvey Kellogg ","MB Collection","Berry College Memorial Library",1929-4-2,,"Creative Commons, non-commercial, attribution, no derivatives",,image-jpeg,en-US,,MB73_1_10_001,"Mount Berry, Georgia",,,,,,,,,,"Miss Martha  Berry ",,,,,,,,,,,,,,,,,,,,,,,,,,,,,,,,,,,,,,,,,,,,,,,,"Battle Creek Sanitarium,ford,John Harvey Kellogg",https://mbda.berry.edu/files/original/3117212a417b6ab764728c4e5e928f24.jpg,,,1,0
13050,https://mbda.berry.edu/items/show/13050,"Letter from John Harvey Kellogg to Martha Berry",,"John Harvey Kellogg says he is happy to know that Miss Berry returned from Europe in better health. He is also glad to hear that Mr. Ford has become interested in helping the school."," John Harvey Kellogg ","MB Collection","Berry College Memorial Library",1930-3-24,,"Creative Commons, non-commercial, attribution, no derivatives",,image-jpeg,en-US,"Text Document",MB77_6_7_001,"Mount Berry, Georgia",,,,,,,,,,"Miss Martha  Berry ","Typewritten (or mostly typewritten)",,,,,,,,,,,,,,,,,,,,,,,,,,,,,,,,,,,,,,,,,,,,,,,"Battle Creek Sanitarium,ford",https://mbda.berry.edu/files/original/91c88be5c9d40b5bf6b8d269578c4bed.jpg,,,1,0
11412,https://mbda.berry.edu/items/show/11412,"Letter from Martha Berry to Alice Wingo",,"Berry asks Wingo to have a group of girls in Clara Hall write to Mr. and Mrs. Ford expressing their appreciation for the privilege of living there."," Martha  Berry ","MB Collection","Berry College Memorial Library",1929-11-21,,"Creative Commons, non-commercial, attribution, no derivatives",,image-jpeg,en-US,"Text Document",MB74_7_63_001,"Mount Berry, Georgia",,,,,,,,,,"Miss   Wingo ","Typewritten (or mostly typewritten)",,,,,,,,,,,,,,,,,,,,,,,,,,,,,,,,,,,,,,,,,,,,,,,"Christmas,Clara Hall,ford",https://mbda.berry.edu/files/original/4ffe0a9cd5703a8f4ad5322486d3ca76.jpg,,,1,0
450,https://mbda.berry.edu/items/show/450,"Letter from Martha Berry to Clara Ford",,"Berry responds to a letter from Ford with details about the weather, visitors to the school who admired the Ford Buildings, taking dolls to mountain children, and Martha Freeman's health. Berry requests a painting of Henry Ford for the dining room."," Martha  Berry ","MB Collection","Berry College Memorial Library",1936-7-9,,,,image-jpeg,en-US,"Text Document",MB112_15_15_001,"Mount Berry, Georgia",,,,,,,,,,"Mrs. Henry  Ford ","Typewritten (or mostly typewritten)",,,,,,,,,,,,,,,,,,,,,,,,,,,,,,,,,,,,,,,,,,,,,,,"African American,birds,drought,ford,Ford buildings,Henry Ford,Lookout Mountain,Martha Freeman,mountain children,portrait,weather","https://mbda.berry.edu/files/original/a7b3d8e2dc369f777d4965c1e1f98865.jpg,https://mbda.berry.edu/files/original/17d98f11a1db423e531707f5c329c39c.jpg",,,1,0
7463,https://mbda.berry.edu/items/show/7463,"Letter from Martha Berry to Ernest Gustav Liebold",,"Berry writes to Henry Ford's secretary to inquire about a two-door car Ford had promised her while visiting the schools. "," Martha  Berry ","MB Collection","Berry College Memorial Library",1928-8-14,,"Creative Commons, non-commercial, attribution, no derivatives",,image-jpeg,en-US,"Text Document",MB67_11_21_001,"Mount Berry, Georgia",,,,,,,,,,"Mr. E. G. Liebold ",,,,,,,,,,,,,,,,,,,,,,,,,,,,,,,,,,,,,,,,,,,,,,,,"car,Ernest Gustav Liebold,ford","https://mbda.berry.edu/files/original/352c99dc70261f4164eda2ddcb7b960f.jpg,https://mbda.berry.edu/files/original/8fa2dc471097d0d5e40a0873c4391b16.jpg",,"The Henry and Clara Ford Series",1,0
6861,https://mbda.berry.edu/items/show/6861,"Letter from Martha Berry to Mr. J.B. Campbell",,"Martha Berry is asking Mr. Campbell for advice over some new Trustees for Berry. She also briefly mentions the Fords coming to visit. ","Miss Martha   Berry ","MB Collection","Berry College Memorial Library",1928-2-18,,"Creative Commons, non-commercial, attribution, no derivatives",,image-jpeg,en-US,"Text Document",MB66_10_11_001,"Mount Berry, Georgia",,,,,,,,,,"Mr. J. Bulow Campbell ","Typewritten (or mostly typewritten)",,,,,,,,,,,,,,,,,,,,,,,,,,,,,,,,,,,,,,,,,,,,,,,"Board of Trustees,ford","https://mbda.berry.edu/files/original/8ebecd681794e67a6ec1503aa6ee03ae.jpg,https://mbda.berry.edu/files/original/57571e1b42f22cde8da5377328064db8.jpg",,,1,0
12996,https://mbda.berry.edu/items/show/12996,"Letter from Martha Berry to Mrs. George F. Johnston ",,"In this letter Martha Berry tells Mildred that she sent her a chair and table as promised along with twenty dollars to cover freight fees. She tells Mildred that she cannot wait for the term to be over, because they are having too many visitors who only have come to see the new Ford buildings."," Martha  Berry ","MB Collection","Berry College Memorial Library",1930-4-5,,"Creative Commons, non-commercial, attribution, no derivatives",,image-jpeg,en-US,"Text Document",MB77_5_27_001,"Mount Berry, Georgia",,,,,,,,,,"Mrs. George F Johnston ","Typewritten (or mostly typewritten)",,,,,,,,,,,,,,,,,,,,,,,,,,,,,,,,,,,,,,,,,,,,,,,ford,https://mbda.berry.edu/files/original/acc080e805c8b43e819fc8fefa38fbab.jpg,,,1,0
12038,https://mbda.berry.edu/items/show/12038,"Letter from Martha Berry to Robert M. Lester",,"Berry inquires about the possibility of a Carnegie Corporation contribution for industrial equipment and buildings at the Boys School."," Martha  Berry ","MB Collection","Berry College Memorial Library",1930-3-28,,"Creative Commons, non-commercial, attribution, no derivatives",,image-jpeg,en-US,"Text Document",MB75_11_9_001,"Mount Berry, Georgia",,,,,,,,,,"Mr. Robert M. Lester ","Typewritten (or mostly typewritten)",,,,,,,,,,,,,,,,,,,,,,,,,,,,,,,,,,,,,,,,,,,,,,,"Carnegie,ford,industrial arts equipment",https://mbda.berry.edu/files/original/57558980cf773dbcaa136b471a6a5fe5.jpg,,,1,0
12325,https://mbda.berry.edu/items/show/12325,"Letter from Mrs. DeLaittre to Martha Berry",,"Mrs. DeLaittre comments on the terrible weather and hopes to get some information from Martha Berry","Mrs. C. P. DeLaittre ","MB Collection","Berry College Memorial Library",1930-9-2,,"Creative Commons, non-commercial, attribution, no derivatives",,image-jpeg,en-US,"Text Document",MB76_9_34_001,"Mount Berry, Georgia",,,,,,,,,,"Miss Martha  Berry ","Handwritten (or mostly handwritten)",,,,,,,,,,,,,,,,,,,,,,,,,,,,,,,,,,,,,,,,,,,,,,,"drought,financial report,ford,millions",https://mbda.berry.edu/files/original/c4f97e7abcc6d07b09c12b2485c17eb1.jpg,,,1,0
7480,https://mbda.berry.edu/items/show/7480,"Letter from The Berry Schools to Mr. E.G. Liebold",,"In this letter E.H. Hoge on behalf of the Berry Schools is asking E.G. Liebold on behalf of Henry Ford if they have recieved the letter in reguard to the weight of the cooking utenstils."," E.H.  Hoge ","MB Collection","Berry College Memorial Library",1928-9-7,,"Creative Commons, non-commercial, attribution, no derivatives",,image-jpeg,en-US,"Text Document",MB67_11_38_001,"Mount Berry, Georgia",,,,,,,,,,"Mr. E.G.  Liebold ","Typewritten (or mostly typewritten)",,,,,,,,,,,,,,,,,,,,,,,,,,,,,,,,,,,,,,,,,,,,,,,"cooking utensils,ford",https://mbda.berry.edu/files/original/03241a4c380faf4b7df493939d7af52f.jpg,,"The Henry and Clara Ford Series",1,0
7517,https://mbda.berry.edu/items/show/7517,"Letter from the E.H. Hoge to Mr. E.G. Liebold",,"E. H. Hoge, the Comptroller of the Berry Schools, sends Mr. E. G. Liebold architect certificate #2516 and asks for a check for $21,826.12 to pay the Thompson-Starrett Company for part of the New Girls School buildings."," E. H. Hoge ","MB Collection","Berry College Memorial Library",1928-11-8,,"Creative Commons, non-commercial, attribution, no derivatives",,image-jpeg,en-US,"Text Document",MB67_11_75_001,"Mount Berry, Georgia",,,,,,,,,,"Mr. E. G. Liebold ","Typewritten (or mostly typewritten)",,,,,,,,,,,,,,,,,,,,,,,,,,,,,,,,,,,,,,,,,,,,,,,"architecture,ford,Girls School,Liebold,Thompson Starrett Company",https://mbda.berry.edu/files/original/d10b540b2fca3c84482e6d650634c872.jpg,,"The Henry and Clara Ford Series",1,0
13600,https://mbda.berry.edu/items/show/13600,"Letter to Abby Orme from Martha Berry",,"Martha writes to Abby about the letter Abby sent earlier about gifts to Berry and sorry to hear that she will not be able to gift this year, but they appreciate her gifts so far. Martha goes to write about the Ford Buildings that Mr. Ford has assisted the school with building as well.","Miss Martha  Berry ","MB Collection","Berry College Memorial Library",1930-2-5,,"Creative Commons, non-commercial, attribution, no derivatives",,image-jpeg,en-US,"Text Document",MB78_4_78_001,"Mount Berry, Georgia",,,,,,,,,,"Miss Abby  Orme ","Typewritten (or mostly typewritten)",,,,,,,,,,,,,,,,,,,,,,,,,,,,,,,,,,,,,,,,,,,,,,,ford,https://mbda.berry.edu/files/original/06118aa692dbc7180071d7b567ffdb2e.jpg,,,1,0
11807,https://mbda.berry.edu/items/show/11807,"Letter to Arthur E. Bestor from Martha Berry",,"Miss Berry thanks Mr. Bestor for the congratulations and explains that it is difficult for many people to understand that Ford's gift was in buildings at the Girl's School so they still need to work hard to raise money to run the other schools. "," Martha  Berry ","MB Collection","Berry College Memorial Library",1930-1-20,,"Creative Commons, non-commercial, attribution, no derivatives",,image-jpeg,en-US,,MB75_4_46_001,"Mount Berry, Georgia",,,,,,,,,,"Mr. Arthur E. Bestor ",,,,,,,,,,,,,,,,,,,,,,,,,,,,,,,,,,,,,,,,,,,,,,,,ford,https://mbda.berry.edu/files/original/8211e7b241f11259df30681911fa131f.jpg,,,1,0